{"text_format":"1","workbook":"xlsx","n_sheets":4,"sheets":["使い方","取込ファイル作成","市民税リスト","市区町村マスタ"],"not_rendered":{"charts":0,"images":10,"macros":1,"external_links":0,"defined_names":1,"comments":0,"pivot_tables":0},"unopened":[],"bounds":{"document_bytes":16777216,"sheet_cells":100000,"rows_first":2000,"rows_last":500,"rows_between":2000,"halvings":0,"cell_chars":16384,"cell_head_chars":4096},"cells_cut":0,"cells_raw":0,"read":"whole","date_system":"1900"}

{"sheet":"使い方","index":0,"n_rows":277,"n_cols":2,"rows_kept":277,"cut":false,"hidden":false,"merged":[]}
["目的"]
[null,"el TAX で、市民税を納付している人向けの支援ツールです"]
[null,"el TAX で、手入力と、ファイル取込でデータを入力できますが、手入力でデータを投入するのはデータ件数もありますが、時間がかかります。"]
[null,"その時間を、少しでも緩和するための目的で作成しています。"]
[]
["使用方法"]
["①","「市民税リスト」シートを選択し、社員の市民税を入力します。"]
[null,"納付書に記載されている内容をもとに、指定番号、市町村コード、氏名、納税年月、納税額を入力します。"]
[]
[]
[]
[]
[]
[]
[]
[]
[]
[]
[]
[]
[]
[]
[]
[]
[]
[]
[]
[]
[]
[]
[]
[]
[]
[]
[]
[]
[]
["②","「取込ファイル作成」シートを選択し、納税月を入力します。"]
[]
[]
[]
[]
[]
[]
[]
[]
[null,"納税月を入力したら、出力ボタンをクリックします。"]
[]
[]
[]
[]
[]
[]
[]
[]
[null,"保存ダイアログが表示されますので、任意の場所にファイルを保存します。"]
[]
[]
[]
[]
[]
[]
[]
[]
[]
[]
[]
[]
[]
[]
[]
[null,"このツールでやることは、以上です。"]
[]
[null,"ここから「el TAX」を利用した操作方法になります。"]
["③","el TAX を表示します"]
[null,"https://www.eltax.lta.go.jp/"]
[]
[]
[]
[]
[]
[]
[]
[]
[]
[]
[]
[]
[]
[]
[]
[]
[]
[]
["④","el TAX にログインします。"]
[]
[]
[]
[]
[]
[]
[]
[]
[]
[]
[]
[]
[]
[]
[]
[]
[]
[]
[]
[]
[]
[]
[]
["⑤","納税メニューを選択します。"]
[]
{"$rows_left_out":158}
{"sheet":"取込ファイル作成","index":1,"n_rows":3,"n_cols":3,"rows_kept":3,"cut":false,"hidden":false,"merged":[[0,0,0,3]]}
["取込ファイルを出力します。"]
[]
[null,"納税月","2020-06-01"]

{"sheet":"市民税リスト","index":2,"n_rows":277,"n_cols":6,"rows_kept":277,"cut":false,"hidden":false,"merged":[]}
["指定番号","市町村コード","市区町村名","氏名","納税年月","納税額"]
["99999999","401307",{"$f":"IF(ISERROR(VLOOKUP($B2,市区町村マスタ!$A$2:$E$1789, 3, FALSE)), \"\", VLOOKUP($B2,市区町村マスタ!$A$2:$E$1789, 3, FALSE))","v":"福岡市"},"エアスポ太郎","2020-06-01",8000]
["99999999","401307",{"$f":"IF(ISERROR(VLOOKUP($B3,市区町村マスタ!$A$2:$E$1789, 3, FALSE)), \"\", VLOOKUP($B3,市区町村マスタ!$A$2:$E$1789, 3, FALSE))","v":"福岡市"},"エアスポ太郎","2020-07-01",7700]
["99999999","401307",{"$f":"IF(ISERROR(VLOOKUP($B4,市区町村マスタ!$A$2:$E$1789, 3, FALSE)), \"\", VLOOKUP($B4,市区町村マスタ!$A$2:$E$1789, 3, FALSE))","v":"福岡市"},"エアスポ太郎","2020-08-01",7700]
["99999999","401307",{"$f":"IF(ISERROR(VLOOKUP($B5,市区町村マスタ!$A$2:$E$1789, 3, FALSE)), \"\", VLOOKUP($B5,市区町村マスタ!$A$2:$E$1789, 3, FALSE))","v":"福岡市"},"エアスポ太郎","2020-09-01",7700]
["99999999","401307",{"$f":"IF(ISERROR(VLOOKUP($B6,市区町村マスタ!$A$2:$E$1789, 3, FALSE)), \"\", VLOOKUP($B6,市区町村マスタ!$A$2:$E$1789, 3, FALSE))","v":"福岡市"},"エアスポ太郎","2020-10-01",7700]
["99999999","401307",{"$f":"IF(ISERROR(VLOOKUP($B7,市区町村マスタ!$A$2:$E$1789, 3, FALSE)), \"\", VLOOKUP($B7,市区町村マスタ!$A$2:$E$1789, 3, FALSE))","v":"福岡市"},"エアスポ太郎","2020-11-01",7700]
["99999999","401307",{"$f":"IF(ISERROR(VLOOKUP($B8,市区町村マスタ!$A$2:$E$1789, 3, FALSE)), \"\", VLOOKUP($B8,市区町村マスタ!$A$2:$E$1789, 3, FALSE))","v":"福岡市"},"エアスポ太郎","2020-12-01",7700]
["99999999","401307",{"$f":"IF(ISERROR(VLOOKUP($B9,市区町村マスタ!$A$2:$E$1789, 3, FALSE)), \"\", VLOOKUP($B9,市区町村マスタ!$A$2:$E$1789, 3, FALSE))","v":"福岡市"},"エアスポ太郎","2021-01-01",7700]
["99999999","401307",{"$f":"IF(ISERROR(VLOOKUP($B10,市区町村マスタ!$A$2:$E$1789, 3, FALSE)), \"\", VLOOKUP($B10,市区町村マスタ!$A$2:$E$1789, 3, FALSE))","v":"福岡市"},"エアスポ太郎","2021-02-01",7700]
["99999999","401307",{"$f":"IF(ISERROR(VLOOKUP($B11,市区町村マスタ!$A$2:$E$1789, 3, FALSE)), \"\", VLOOKUP($B11,市区町村マスタ!$A$2:$E$1789, 3, FALSE))","v":"福岡市"},"エアスポ太郎","2021-03-01",7700]
["99999999","401307",{"$f":"IF(ISERROR(VLOOKUP($B12,市区町村マスタ!$A$2:$E$1789, 3, FALSE)), \"\", VLOOKUP($B12,市区町村マスタ!$A$2:$E$1789, 3, FALSE))","v":"福岡市"},"エアスポ太郎","2021-04-01",7700]
["99999999","401307",{"$f":"IF(ISERROR(VLOOKUP($B13,市区町村マスタ!$A$2:$E$1789, 3, FALSE)), \"\", VLOOKUP($B13,市区町村マスタ!$A$2:$E$1789, 3, FALSE))","v":"福岡市"},"エアスポ太郎","2021-05-01",7700]
[null,null,{"$f":"IF(ISERROR(VLOOKUP($B14,市区町村マスタ!$A$2:$E$1789, 3, FALSE)), \"\", VLOOKUP($B14,市区町村マスタ!$A$2:$E$1789, 3, FALSE))","v":""}]
[null,null,{"$f":"IF(ISERROR(VLOOKUP($B15,市区町村マスタ!$A$2:$E$1789, 3, FALSE)), \"\", VLOOKUP($B15,市区町村マスタ!$A$2:$E$1789, 3, FALSE))","v":""}]
[null,null,{"$f":"IF(ISERROR(VLOOKUP($B16,市区町村マスタ!$A$2:$E$1789, 3, FALSE)), \"\", VLOOKUP($B16,市区町村マスタ!$A$2:$E$1789, 3, FALSE))","v":""}]
[null,null,{"$f":"IF(ISERROR(VLOOKUP($B17,市区町村マスタ!$A$2:$E$1789, 3, FALSE)), \"\", VLOOKUP($B17,市区町村マスタ!$A$2:$E$1789, 3, FALSE))","v":""}]
[null,null,{"$f":"IF(ISERROR(VLOOKUP($B18,市区町村マスタ!$A$2:$E$1789, 3, FALSE)), \"\", VLOOKUP($B18,市区町村マスタ!$A$2:$E$1789, 3, FALSE))","v":""}]
[null,null,{"$f":"IF(ISERROR(VLOOKUP($B19,市区町村マスタ!$A$2:$E$1789, 3, FALSE)), \"\", VLOOKUP($B19,市区町村マスタ!$A$2:$E$1789, 3, FALSE))","v":""}]
[null,null,{"$f":"IF(ISERROR(VLOOKUP($B20,市区町村マスタ!$A$2:$E$1789, 3, FALSE)), \"\", VLOOKUP($B20,市区町村マスタ!$A$2:$E$1789, 3, FALSE))","v":""}]
[null,null,{"$f":"IF(ISERROR(VLOOKUP($B21,市区町村マスタ!$A$2:$E$1789, 3, FALSE)), \"\", VLOOKUP($B21,市区町村マスタ!$A$2:$E$1789, 3, FALSE))","v":""}]
[null,null,{"$f":"IF(ISERROR(VLOOKUP($B22,市区町村マスタ!$A$2:$E$1789, 3, FALSE)), \"\", VLOOKUP($B22,市区町村マスタ!$A$2:$E$1789, 3, FALSE))","v":""}]
[null,null,{"$f":"IF(ISERROR(VLOOKUP($B23,市区町村マスタ!$A$2:$E$1789, 3, FALSE)), \"\", VLOOKUP($B23,市区町村マスタ!$A$2:$E$1789, 3, FALSE))","v":""}]
[null,null,{"$f":"IF(ISERROR(VLOOKUP($B24,市区町村マスタ!$A$2:$E$1789, 3, FALSE)), \"\", VLOOKUP($B24,市区町村マスタ!$A$2:$E$1789, 3, FALSE))","v":""}]
[null,null,{"$f":"IF(ISERROR(VLOOKUP($B25,市区町村マスタ!$A$2:$E$1789, 3, FALSE)), \"\", VLOOKUP($B25,市区町村マスタ!$A$2:$E$1789, 3, FALSE))","v":""}]
[null,null,{"$f":"IF(ISERROR(VLOOKUP($B26,市区町村マスタ!$A$2:$E$1789, 3, FALSE)), \"\", VLOOKUP($B26,市区町村マスタ!$A$2:$E$1789, 3, FALSE))","v":""}]
[null,null,{"$f":"IF(ISERROR(VLOOKUP($B27,市区町村マスタ!$A$2:$E$1789, 3, FALSE)), \"\", VLOOKUP($B27,市区町村マスタ!$A$2:$E$1789, 3, FALSE))","v":""}]
[null,null,{"$f":"IF(ISERROR(VLOOKUP($B28,市区町村マスタ!$A$2:$E$1789, 3, FALSE)), \"\", VLOOKUP($B28,市区町村マスタ!$A$2:$E$1789, 3, FALSE))","v":""}]
[null,null,{"$f":"IF(ISERROR(VLOOKUP($B29,市区町村マスタ!$A$2:$E$1789, 3, FALSE)), \"\", VLOOKUP($B29,市区町村マスタ!$A$2:$E$1789, 3, FALSE))","v":""}]
[null,null,{"$f":"IF(ISERROR(VLOOKUP($B30,市区町村マスタ!$A$2:$E$1789, 3, FALSE)), \"\", VLOOKUP($B30,市区町村マスタ!$A$2:$E$1789, 3, FALSE))","v":""}]
[null,null,{"$f":"IF(ISERROR(VLOOKUP($B31,市区町村マスタ!$A$2:$E$1789, 3, FALSE)), \"\", VLOOKUP($B31,市区町村マスタ!$A$2:$E$1789, 3, FALSE))","v":""}]
[null,null,{"$f":"IF(ISERROR(VLOOKUP($B32,市区町村マスタ!$A$2:$E$1789, 3, FALSE)), \"\", VLOOKUP($B32,市区町村マスタ!$A$2:$E$1789, 3, FALSE))","v":""}]
[null,null,{"$f":"IF(ISERROR(VLOOKUP($B33,市区町村マスタ!$A$2:$E$1789, 3, FALSE)), \"\", VLOOKUP($B33,市区町村マスタ!$A$2:$E$1789, 3, FALSE))","v":""}]
[null,null,{"$f":"IF(ISERROR(VLOOKUP($B34,市区町村マスタ!$A$2:$E$1789, 3, FALSE)), \"\", VLOOKUP($B34,市区町村マスタ!$A$2:$E$1789, 3, FALSE))","v":""}]
[null,null,{"$f":"IF(ISERROR(VLOOKUP($B35,市区町村マスタ!$A$2:$E$1789, 3, FALSE)), \"\", VLOOKUP($B35,市区町村マスタ!$A$2:$E$1789, 3, FALSE))","v":""}]
[null,null,{"$f":"IF(ISERROR(VLOOKUP($B36,市区町村マスタ!$A$2:$E$1789, 3, FALSE)), \"\", VLOOKUP($B36,市区町村マスタ!$A$2:$E$1789, 3, FALSE))","v":""}]
[null,null,{"$f":"IF(ISERROR(VLOOKUP($B37,市区町村マスタ!$A$2:$E$1789, 3, FALSE)), \"\", VLOOKUP($B37,市区町村マスタ!$A$2:$E$1789, 3, FALSE))","v":""}]
[null,null,{"$f":"IF(ISERROR(VLOOKUP($B38,市区町村マスタ!$A$2:$E$1789, 3, FALSE)), \"\", VLOOKUP($B38,市区町村マスタ!$A$2:$E$1789, 3, FALSE))","v":""}]
[null,null,{"$f":"IF(ISERROR(VLOOKUP($B39,市区町村マスタ!$A$2:$E$1789, 3, FALSE)), \"\", VLOOKUP($B39,市区町村マスタ!$A$2:$E$1789, 3, FALSE))","v":""}]
[null,null,{"$f":"IF(ISERROR(VLOOKUP($B40,市区町村マスタ!$A$2:$E$1789, 3, FALSE)), \"\", VLOOKUP($B40,市区町村マスタ!$A$2:$E$1789, 3, FALSE))","v":""}]
[null,null,{"$f":"IF(ISERROR(VLOOKUP($B41,市区町村マスタ!$A$2:$E$1789, 3, FALSE)), \"\", VLOOKUP($B41,市区町村マスタ!$A$2:$E$1789, 3, FALSE))","v":""}]
[null,null,{"$f":"IF(ISERROR(VLOOKUP($B42,市区町村マスタ!$A$2:$E$1789, 3, FALSE)), \"\", VLOOKUP($B42,市区町村マスタ!$A$2:$E$1789, 3, FALSE))","v":""}]
[null,null,{"$f":"IF(ISERROR(VLOOKUP($B43,市区町村マスタ!$A$2:$E$1789, 3, FALSE)), \"\", VLOOKUP($B43,市区町村マスタ!$A$2:$E$1789, 3, FALSE))","v":""}]
[null,null,{"$f":"IF(ISERROR(VLOOKUP($B44,市区町村マスタ!$A$2:$E$1789, 3, FALSE)), \"\", VLOOKUP($B44,市区町村マスタ!$A$2:$E$1789, 3, FALSE))","v":""}]
[null,null,{"$f":"IF(ISERROR(VLOOKUP($B45,市区町村マスタ!$A$2:$E$1789, 3, FALSE)), \"\", VLOOKUP($B45,市区町村マスタ!$A$2:$E$1789, 3, FALSE))","v":""}]
[null,null,{"$f":"IF(ISERROR(VLOOKUP($B46,市区町村マスタ!$A$2:$E$1789, 3, FALSE)), \"\", VLOOKUP($B46,市区町村マスタ!$A$2:$E$1789, 3, FALSE))","v":""}]
[null,null,{"$f":"IF(ISERROR(VLOOKUP($B47,市区町村マスタ!$A$2:$E$1789, 3, FALSE)), \"\", VLOOKUP($B47,市区町村マスタ!$A$2:$E$1789, 3, FALSE))","v":""}]
[null,null,{"$f":"IF(ISERROR(VLOOKUP($B48,市区町村マスタ!$A$2:$E$1789, 3, FALSE)), \"\", VLOOKUP($B48,市区町村マスタ!$A$2:$E$1789, 3, FALSE))","v":""}]
[null,null,{"$f":"IF(ISERROR(VLOOKUP($B49,市区町村マスタ!$A$2:$E$1789, 3, FALSE)), \"\", VLOOKUP($B49,市区町村マスタ!$A$2:$E$1789, 3, FALSE))","v":""}]
[null,null,{"$f":"IF(ISERROR(VLOOKUP($B50,市区町村マスタ!$A$2:$E$1789, 3, FALSE)), \"\", VLOOKUP($B50,市区町村マスタ!$A$2:$E$1789, 3, FALSE))","v":""}]
[null,null,{"$f":"IF(ISERROR(VLOOKUP($B51,市区町村マスタ!$A$2:$E$1789, 3, FALSE)), \"\", VLOOKUP($B51,市区町村マスタ!$A$2:$E$1789, 3, FALSE))","v":""}]
[null,null,{"$f":"IF(ISERROR(VLOOKUP($B52,市区町村マスタ!$A$2:$E$1789, 3, FALSE)), \"\", VLOOKUP($B52,市区町村マスタ!$A$2:$E$1789, 3, FALSE))","v":""}]
[null,null,{"$f":"IF(ISERROR(VLOOKUP($B53,市区町村マスタ!$A$2:$E$1789, 3, FALSE)), \"\", VLOOKUP($B53,市区町村マスタ!$A$2:$E$1789, 3, FALSE))","v":""}]
[null,null,{"$f":"IF(ISERROR(VLOOKUP($B54,市区町村マスタ!$A$2:$E$1789, 3, FALSE)), \"\", VLOOKUP($B54,市区町村マスタ!$A$2:$E$1789, 3, FALSE))","v":""}]
[null,null,{"$f":"IF(ISERROR(VLOOKUP($B55,市区町村マスタ!$A$2:$E$1789, 3, FALSE)), \"\", VLOOKUP($B55,市区町村マスタ!$A$2:$E$1789, 3, FALSE))","v":""}]
[null,null,{"$f":"IF(ISERROR(VLOOKUP($B56,市区町村マスタ!$A$2:$E$1789, 3, FALSE)), \"\", VLOOKUP($B56,市区町村マスタ!$A$2:$E$1789, 3, FALSE))","v":""}]
[null,null,{"$f":"IF(ISERROR(VLOOKUP($B57,市区町村マスタ!$A$2:$E$1789, 3, FALSE)), \"\", VLOOKUP($B57,市区町村マスタ!$A$2:$E$1789, 3, FALSE))","v":""}]
[null,null,{"$f":"IF(ISERROR(VLOOKUP($B58,市区町村マスタ!$A$2:$E$1789, 3, FALSE)), \"\", VLOOKUP($B58,市区町村マスタ!$A$2:$E$1789, 3, FALSE))","v":""}]
[null,null,{"$f":"IF(ISERROR(VLOOKUP($B59,市区町村マスタ!$A$2:$E$1789, 3, FALSE)), \"\", VLOOKUP($B59,市区町村マスタ!$A$2:$E$1789, 3, FALSE))","v":""}]
[null,null,{"$f":"IF(ISERROR(VLOOKUP($B60,市区町村マスタ!$A$2:$E$1789, 3, FALSE)), \"\", VLOOKUP($B60,市区町村マスタ!$A$2:$E$1789, 3, FALSE))","v":""}]
[null,null,{"$f":"IF(ISERROR(VLOOKUP($B61,市区町村マスタ!$A$2:$E$1789, 3, FALSE)), \"\", VLOOKUP($B61,市区町村マスタ!$A$2:$E$1789, 3, FALSE))","v":""}]
[null,null,{"$f":"IF(ISERROR(VLOOKUP($B62,市区町村マスタ!$A$2:$E$1789, 3, FALSE)), \"\", VLOOKUP($B62,市区町村マスタ!$A$2:$E$1789, 3, FALSE))","v":""}]
[null,null,{"$f":"IF(ISERROR(VLOOKUP($B63,市区町村マスタ!$A$2:$E$1789, 3, FALSE)), \"\", VLOOKUP($B63,市区町村マスタ!$A$2:$E$1789, 3, FALSE))","v":""}]
[null,null,{"$f":"IF(ISERROR(VLOOKUP($B64,市区町村マスタ!$A$2:$E$1789, 3, FALSE)), \"\", VLOOKUP($B64,市区町村マスタ!$A$2:$E$1789, 3, FALSE))","v":""}]
[null,null,{"$f":"IF(ISERROR(VLOOKUP($B65,市区町村マスタ!$A$2:$E$1789, 3, FALSE)), \"\", VLOOKUP($B65,市区町村マスタ!$A$2:$E$1789, 3, FALSE))","v":""}]
[null,null,{"$f":"IF(ISERROR(VLOOKUP($B66,市区町村マスタ!$A$2:$E$1789, 3, FALSE)), \"\", VLOOKUP($B66,市区町村マスタ!$A$2:$E$1789, 3, FALSE))","v":""}]
[null,null,{"$f":"IF(ISERROR(VLOOKUP($B67,市区町村マスタ!$A$2:$E$1789, 3, FALSE)), \"\", VLOOKUP($B67,市区町村マスタ!$A$2:$E$1789, 3, FALSE))","v":""}]
[null,null,{"$f":"IF(ISERROR(VLOOKUP($B68,市区町村マスタ!$A$2:$E$1789, 3, FALSE)), \"\", VLOOKUP($B68,市区町村マスタ!$A$2:$E$1789, 3, FALSE))","v":""}]
[null,null,{"$f":"IF(ISERROR(VLOOKUP($B69,市区町村マスタ!$A$2:$E$1789, 3, FALSE)), \"\", VLOOKUP($B69,市区町村マスタ!$A$2:$E$1789, 3, FALSE))","v":""}]
[null,null,{"$f":"IF(ISERROR(VLOOKUP($B70,市区町村マスタ!$A$2:$E$1789, 3, FALSE)), \"\", VLOOKUP($B70,市区町村マスタ!$A$2:$E$1789, 3, FALSE))","v":""}]
[null,null,{"$f":"IF(ISERROR(VLOOKUP($B71,市区町村マスタ!$A$2:$E$1789, 3, FALSE)), \"\", VLOOKUP($B71,市区町村マスタ!$A$2:$E$1789, 3, FALSE))","v":""}]
[null,null,{"$f":"IF(ISERROR(VLOOKUP($B72,市区町村マスタ!$A$2:$E$1789, 3, FALSE)), \"\", VLOOKUP($B72,市区町村マスタ!$A$2:$E$1789, 3, FALSE))","v":""}]
[null,null,{"$f":"IF(ISERROR(VLOOKUP($B73,市区町村マスタ!$A$2:$E$1789, 3, FALSE)), \"\", VLOOKUP($B73,市区町村マスタ!$A$2:$E$1789, 3, FALSE))","v":""}]
[null,null,{"$f":"IF(ISERROR(VLOOKUP($B74,市区町村マスタ!$A$2:$E$1789, 3, FALSE)), \"\", VLOOKUP($B74,市区町村マスタ!$A$2:$E$1789, 3, FALSE))","v":""}]
[null,null,{"$f":"IF(ISERROR(VLOOKUP($B75,市区町村マスタ!$A$2:$E$1789, 3, FALSE)), \"\", VLOOKUP($B75,市区町村マスタ!$A$2:$E$1789, 3, FALSE))","v":""}]
[null,null,{"$f":"IF(ISERROR(VLOOKUP($B76,市区町村マスタ!$A$2:$E$1789, 3, FALSE)), \"\", VLOOKUP($B76,市区町村マスタ!$A$2:$E$1789, 3, FALSE))","v":""}]
[null,null,{"$f":"IF(ISERROR(VLOOKUP($B77,市区町村マスタ!$A$2:$E$1789, 3, FALSE)), \"\", VLOOKUP($B77,市区町村マスタ!$A$2:$E$1789, 3, FALSE))","v":""}]
[null,null,{"$f":"IF(ISERROR(VLOOKUP($B78,市区町村マスタ!$A$2:$E$1789, 3, FALSE)), \"\", VLOOKUP($B78,市区町村マスタ!$A$2:$E$1789, 3, FALSE))","v":""}]
[null,null,{"$f":"IF(ISERROR(VLOOKUP($B79,市区町村マスタ!$A$2:$E$1789, 3, FALSE)), \"\", VLOOKUP($B79,市区町村マスタ!$A$2:$E$1789, 3, FALSE))","v":""}]
[null,null,{"$f":"IF(ISERROR(VLOOKUP($B80,市区町村マスタ!$A$2:$E$1789, 3, FALSE)), \"\", VLOOKUP($B80,市区町村マスタ!$A$2:$E$1789, 3, FALSE))","v":""}]
[null,null,{"$f":"IF(ISERROR(VLOOKUP($B81,市区町村マスタ!$A$2:$E$1789, 3, FALSE)), \"\", VLOOKUP($B81,市区町村マスタ!$A$2:$E$1789, 3, FALSE))","v":""}]
[null,null,{"$f":"IF(ISERROR(VLOOKUP($B82,市区町村マスタ!$A$2:$E$1789, 3, FALSE)), \"\", VLOOKUP($B82,市区町村マスタ!$A$2:$E$1789, 3, FALSE))","v":""}]
[null,null,{"$f":"IF(ISERROR(VLOOKUP($B83,市区町村マスタ!$A$2:$E$1789, 3, FALSE)), \"\", VLOOKUP($B83,市区町村マスタ!$A$2:$E$1789, 3, FALSE))","v":""}]
[null,null,{"$f":"IF(ISERROR(VLOOKUP($B84,市区町村マスタ!$A$2:$E$1789, 3, FALSE)), \"\", VLOOKUP($B84,市区町村マスタ!$A$2:$E$1789, 3, FALSE))","v":""}]
[null,null,{"$f":"IF(ISERROR(VLOOKUP($B85,市区町村マスタ!$A$2:$E$1789, 3, FALSE)), \"\", VLOOKUP($B85,市区町村マスタ!$A$2:$E$1789, 3, FALSE))","v":""}]
[null,null,{"$f":"IF(ISERROR(VLOOKUP($B86,市区町村マスタ!$A$2:$E$1789, 3, FALSE)), \"\", VLOOKUP($B86,市区町村マスタ!$A$2:$E$1789, 3, FALSE))","v":""}]
[null,null,{"$f":"IF(ISERROR(VLOOKUP($B87,市区町村マスタ!$A$2:$E$1789, 3, FALSE)), \"\", VLOOKUP($B87,市区町村マスタ!$A$2:$E$1789, 3, FALSE))","v":""}]
[null,null,{"$f":"IF(ISERROR(VLOOKUP($B88,市区町村マスタ!$A$2:$E$1789, 3, FALSE)), \"\", VLOOKUP($B88,市区町村マスタ!$A$2:$E$1789, 3, FALSE))","v":""}]
[null,null,{"$f":"IF(ISERROR(VLOOKUP($B89,市区町村マスタ!$A$2:$E$1789, 3, FALSE)), \"\", VLOOKUP($B89,市区町村マスタ!$A$2:$E$1789, 3, FALSE))","v":""}]
[null,null,{"$f":"IF(ISERROR(VLOOKUP($B90,市区町村マスタ!$A$2:$E$1789, 3, FALSE)), \"\", VLOOKUP($B90,市区町村マスタ!$A$2:$E$1789, 3, FALSE))","v":""}]
[null,null,{"$f":"IF(ISERROR(VLOOKUP($B91,市区町村マスタ!$A$2:$E$1789, 3, FALSE)), \"\", VLOOKUP($B91,市区町村マスタ!$A$2:$E$1789, 3, FALSE))","v":""}]
[null,null,{"$f":"IF(ISERROR(VLOOKUP($B92,市区町村マスタ!$A$2:$E$1789, 3, FALSE)), \"\", VLOOKUP($B92,市区町村マスタ!$A$2:$E$1789, 3, FALSE))","v":""}]
[null,null,{"$f":"IF(ISERROR(VLOOKUP($B93,市区町村マスタ!$A$2:$E$1789, 3, FALSE)), \"\", VLOOKUP($B93,市区町村マスタ!$A$2:$E$1789, 3, FALSE))","v":""}]
[null,null,{"$f":"IF(ISERROR(VLOOKUP($B94,市区町村マスタ!$A$2:$E$1789, 3, FALSE)), \"\", VLOOKUP($B94,市区町村マスタ!$A$2:$E$1789, 3, FALSE))","v":""}]
[null,null,{"$f":"IF(ISERROR(VLOOKUP($B95,市区町村マスタ!$A$2:$E$1789, 3, FALSE)), \"\", VLOOKUP($B95,市区町村マスタ!$A$2:$E$1789, 3, FALSE))","v":""}]
[null,null,{"$f":"IF(ISERROR(VLOOKUP($B96,市区町村マスタ!$A$2:$E$1789, 3, FALSE)), \"\", VLOOKUP($B96,市区町村マスタ!$A$2:$E$1789, 3, FALSE))","v":""}]
[null,null,{"$f":"IF(ISERROR(VLOOKUP($B97,市区町村マスタ!$A$2:$E$1789, 3, FALSE)), \"\", VLOOKUP($B97,市区町村マスタ!$A$2:$E$1789, 3, FALSE))","v":""}]
[null,null,{"$f":"IF(ISERROR(VLOOKUP($B98,市区町村マスタ!$A$2:$E$1789, 3, FALSE)), \"\", VLOOKUP($B98,市区町村マスタ!$A$2:$E$1789, 3, FALSE))","v":""}]
[null,null,{"$f":"IF(ISERROR(VLOOKUP($B99,市区町村マスタ!$A$2:$E$1789, 3, FALSE)), \"\", VLOOKUP($B99,市区町村マスタ!$A$2:$E$1789, 3, FALSE))","v":""}]
[null,null,{"$f":"IF(ISERROR(VLOOKUP($B100,市区町村マスタ!$A$2:$E$1789, 3, FALSE)), \"\", VLOOKUP($B100,市区町村マスタ!$A$2:$E$1789, 3, FALSE))","v":""}]
[null,null,{"$f":"IF(ISERROR(VLOOKUP($B101,市区町村マスタ!$A$2:$E$1789, 3, FALSE)), \"\", VLOOKUP($B101,市区町村マスタ!$A$2:$E$1789, 3, FALSE))","v":""}]
[null,null,{"$f":"IF(ISERROR(VLOOKUP($B102,市区町村マスタ!$A$2:$E$1789, 3, FALSE)), \"\", VLOOKUP($B102,市区町村マスタ!$A$2:$E$1789, 3, FALSE))","v":""}]
[null,null,{"$f":"IF(ISERROR(VLOOKUP($B103,市区町村マスタ!$A$2:$E$1789, 3, FALSE)), \"\", VLOOKUP($B103,市区町村マスタ!$A$2:$E$1789, 3, FALSE))","v":""}]
[null,null,{"$f":"IF(ISERROR(VLOOKUP($B104,市区町村マスタ!$A$2:$E$1789, 3, FALSE)), \"\", VLOOKUP($B104,市区町村マスタ!$A$2:$E$1789, 3, FALSE))","v":""}]
[null,null,{"$f":"IF(ISERROR(VLOOKUP($B105,市区町村マスタ!$A$2:$E$1789, 3, FALSE)), \"\", VLOOKUP($B105,市区町村マスタ!$A$2:$E$1789, 3, FALSE))","v":""}]
[null,null,{"$f":"IF(ISERROR(VLOOKUP($B106,市区町村マスタ!$A$2:$E$1789, 3, FALSE)), \"\", VLOOKUP($B106,市区町村マスタ!$A$2:$E$1789, 3, FALSE))","v":""}]
[null,null,{"$f":"IF(ISERROR(VLOOKUP($B107,市区町村マスタ!$A$2:$E$1789, 3, FALSE)), \"\", VLOOKUP($B107,市区町村マスタ!$A$2:$E$1789, 3, FALSE))","v":""}]
[null,null,{"$f":"IF(ISERROR(VLOOKUP($B108,市区町村マスタ!$A$2:$E$1789, 3, FALSE)), \"\", VLOOKUP($B108,市区町村マスタ!$A$2:$E$1789, 3, FALSE))","v":""}]
[null,null,{"$f":"IF(ISERROR(VLOOKUP($B109,市区町村マスタ!$A$2:$E$1789, 3, FALSE)), \"\", VLOOKUP($B109,市区町村マスタ!$A$2:$E$1789, 3, FALSE))","v":""}]
[null,null,{"$f":"IF(ISERROR(VLOOKUP($B110,市区町村マスタ!$A$2:$E$1789, 3, FALSE)), \"\", VLOOKUP($B110,市区町村マスタ!$A$2:$E$1789, 3, FALSE))","v":""}]
[null,null,{"$f":"IF(ISERROR(VLOOKUP($B111,市区町村マスタ!$A$2:$E$1789, 3, FALSE)), \"\", VLOOKUP($B111,市区町村マスタ!$A$2:$E$1789, 3, FALSE))","v":""}]
[null,null,{"$f":"IF(ISERROR(VLOOKUP($B112,市区町村マスタ!$A$2:$E$1789, 3, FALSE)), \"\", VLOOKUP($B112,市区町村マスタ!$A$2:$E$1789, 3, FALSE))","v":""}]
[null,null,{"$f":"IF(ISERROR(VLOOKUP($B113,市区町村マスタ!$A$2:$E$1789, 3, FALSE)), \"\", VLOOKUP($B113,市区町村マスタ!$A$2:$E$1789, 3, FALSE))","v":""}]
[null,null,{"$f":"IF(ISERROR(VLOOKUP($B114,市区町村マスタ!$A$2:$E$1789, 3, FALSE)), \"\", VLOOKUP($B114,市区町村マスタ!$A$2:$E$1789, 3, FALSE))","v":""}]
[null,null,{"$f":"IF(ISERROR(VLOOKUP($B115,市区町村マスタ!$A$2:$E$1789, 3, FALSE)), \"\", VLOOKUP($B115,市区町村マスタ!$A$2:$E$1789, 3, FALSE))","v":""}]
[null,null,{"$f":"IF(ISERROR(VLOOKUP($B116,市区町村マスタ!$A$2:$E$1789, 3, FALSE)), \"\", VLOOKUP($B116,市区町村マスタ!$A$2:$E$1789, 3, FALSE))","v":""}]
[null,null,{"$f":"IF(ISERROR(VLOOKUP($B117,市区町村マスタ!$A$2:$E$1789, 3, FALSE)), \"\", VLOOKUP($B117,市区町村マスタ!$A$2:$E$1789, 3, FALSE))","v":""}]
[null,null,{"$f":"IF(ISERROR(VLOOKUP($B118,市区町村マスタ!$A$2:$E$1789, 3, FALSE)), \"\", VLOOKUP($B118,市区町村マスタ!$A$2:$E$1789, 3, FALSE))","v":""}]
[null,null,{"$f":"IF(ISERROR(VLOOKUP($B119,市区町村マスタ!$A$2:$E$1789, 3, FALSE)), \"\", VLOOKUP($B119,市区町村マスタ!$A$2:$E$1789, 3, FALSE))","v":""}]
[null,null,{"$f":"IF(ISERROR(VLOOKUP($B120,市区町村マスタ!$A$2:$E$1789, 3, FALSE)), \"\", VLOOKUP($B120,市区町村マスタ!$A$2:$E$1789, 3, FALSE))","v":""}]
{"$rows_left_out":158}
{"sheet":"市区町村マスタ","index":3,"n_rows":1789,"n_cols":5,"rows_kept":1789,"cut":false,"hidden":false,"merged":[]}
["団体コード","都道府県名\n（漢字）","市区町村名\n（漢字）","都道府県名\n（カナ）","市区町村名\n（カナ）"]
["010006","北海道",null,"ﾎｯｶｲﾄﾞｳ"]
["011002","北海道","札幌市","ﾎｯｶｲﾄﾞｳ","ｻｯﾎﾟﾛｼ"]
["012025","北海道","函館市","ﾎｯｶｲﾄﾞｳ","ﾊｺﾀﾞﾃｼ"]
["012033","北海道","小樽市","ﾎｯｶｲﾄﾞｳ","ｵﾀﾙｼ"]
["012041","北海道","旭川市","ﾎｯｶｲﾄﾞｳ","ｱｻﾋｶﾜｼ"]
["012050","北海道","室蘭市","ﾎｯｶｲﾄﾞｳ","ﾑﾛﾗﾝｼ"]
["012068","北海道","釧路市","ﾎｯｶｲﾄﾞｳ","ｸｼﾛｼ"]
["012076","北海道","帯広市","ﾎｯｶｲﾄﾞｳ","ｵﾋﾞﾋﾛｼ"]
["012084","北海道","北見市","ﾎｯｶｲﾄﾞｳ","ｷﾀﾐｼ"]
["012092","北海道","夕張市","ﾎｯｶｲﾄﾞｳ","ﾕｳﾊﾞﾘｼ"]
["012106","北海道","岩見沢市","ﾎｯｶｲﾄﾞｳ","ｲﾜﾐｻﾞﾜｼ"]
["012114","北海道","網走市","ﾎｯｶｲﾄﾞｳ","ｱﾊﾞｼﾘｼ"]
["012122","北海道","留萌市","ﾎｯｶｲﾄﾞｳ","ﾙﾓｲｼ"]
["012131","北海道","苫小牧市","ﾎｯｶｲﾄﾞｳ","ﾄﾏｺﾏｲｼ"]
["012149","北海道","稚内市","ﾎｯｶｲﾄﾞｳ","ﾜｯｶﾅｲｼ"]
["012157","北海道","美唄市","ﾎｯｶｲﾄﾞｳ","ﾋﾞﾊﾞｲｼ"]
["012165","北海道","芦別市","ﾎｯｶｲﾄﾞｳ","ｱｼﾍﾞﾂｼ"]
["012173","北海道","江別市","ﾎｯｶｲﾄﾞｳ","ｴﾍﾞﾂｼ"]
["012181","北海道","赤平市","ﾎｯｶｲﾄﾞｳ","ｱｶﾋﾞﾗｼ"]
["012190","北海道","紋別市","ﾎｯｶｲﾄﾞｳ","ﾓﾝﾍﾞﾂｼ"]
["012203","北海道","士別市","ﾎｯｶｲﾄﾞｳ","ｼﾍﾞﾂｼ"]
["012211","北海道","名寄市","ﾎｯｶｲﾄﾞｳ","ﾅﾖﾛｼ"]
["012220","北海道","三笠市","ﾎｯｶｲﾄﾞｳ","ﾐｶｻｼ"]
["012238","北海道","根室市","ﾎｯｶｲﾄﾞｳ","ﾈﾑﾛｼ"]
["012246","北海道","千歳市","ﾎｯｶｲﾄﾞｳ","ﾁﾄｾｼ"]
["012254","北海道","滝川市","ﾎｯｶｲﾄﾞｳ","ﾀｷｶﾜｼ"]
["012262","北海道","砂川市","ﾎｯｶｲﾄﾞｳ","ｽﾅｶﾞﾜｼ"]
["012271","北海道","歌志内市","ﾎｯｶｲﾄﾞｳ","ｳﾀｼﾅｲｼ"]
["012289","北海道","深川市","ﾎｯｶｲﾄﾞｳ","ﾌｶｶﾞﾜｼ"]
["012297","北海道","富良野市","ﾎｯｶｲﾄﾞｳ","ﾌﾗﾉｼ"]
["012301","北海道","登別市","ﾎｯｶｲﾄﾞｳ","ﾉﾎﾞﾘﾍﾞﾂｼ"]
["012319","北海道","恵庭市","ﾎｯｶｲﾄﾞｳ","ｴﾆﾜｼ"]
["012335","北海道","伊達市","ﾎｯｶｲﾄﾞｳ","ﾀﾞﾃｼ"]
["012343","北海道","北広島市","ﾎｯｶｲﾄﾞｳ","ｷﾀﾋﾛｼﾏｼ"]
["012351","北海道","石狩市","ﾎｯｶｲﾄﾞｳ","ｲｼｶﾘｼ"]
["012360","北海道","北斗市","ﾎｯｶｲﾄﾞｳ","ﾎｸﾄｼ"]
["013030","北海道","当別町","ﾎｯｶｲﾄﾞｳ","ﾄｳﾍﾞﾂﾁｮｳ"]
["013048","北海道","新篠津村","ﾎｯｶｲﾄﾞｳ","ｼﾝｼﾉﾂﾑﾗ"]
["013315","北海道","松前町","ﾎｯｶｲﾄﾞｳ","ﾏﾂﾏｴﾁｮｳ"]
["013323","北海道","福島町","ﾎｯｶｲﾄﾞｳ","ﾌｸｼﾏﾁｮｳ"]
["013331","北海道","知内町","ﾎｯｶｲﾄﾞｳ","ｼﾘｳﾁﾁｮｳ"]
["013340","北海道","木古内町","ﾎｯｶｲﾄﾞｳ","ｷｺﾅｲﾁｮｳ"]
["013374","北海道","七飯町","ﾎｯｶｲﾄﾞｳ","ﾅﾅｴﾁｮｳ"]
["013439","北海道","鹿部町","ﾎｯｶｲﾄﾞｳ","ｼｶﾍﾞﾁｮｳ"]
["013455","北海道","森町","ﾎｯｶｲﾄﾞｳ","ﾓﾘﾏﾁ"]
["013463","北海道","八雲町","ﾎｯｶｲﾄﾞｳ","ﾔｸﾓﾁｮｳ"]
["013471","北海道","長万部町","ﾎｯｶｲﾄﾞｳ","ｵｼｬﾏﾝﾍﾞﾁｮｳ"]
["013617","北海道","江差町","ﾎｯｶｲﾄﾞｳ","ｴｻｼﾁｮｳ"]
["013625","北海道","上ノ国町","ﾎｯｶｲﾄﾞｳ","ｶﾐﾉｸﾆﾁｮｳ"]
["013633","北海道","厚沢部町","ﾎｯｶｲﾄﾞｳ","ｱｯｻﾌﾞﾁｮｳ"]
["013641","北海道","乙部町","ﾎｯｶｲﾄﾞｳ","ｵﾄﾍﾞﾁｮｳ"]
["013676","北海道","奥尻町","ﾎｯｶｲﾄﾞｳ","ｵｸｼﾘﾁｮｳ"]
["013706","北海道","今金町","ﾎｯｶｲﾄﾞｳ","ｲﾏｶﾈﾁｮｳ"]
["013714","北海道","せたな町","ﾎｯｶｲﾄﾞｳ","ｾﾀﾅﾁｮｳ"]
["013919","北海道","島牧村","ﾎｯｶｲﾄﾞｳ","ｼﾏﾏｷﾑﾗ"]
["013927","北海道","寿都町","ﾎｯｶｲﾄﾞｳ","ｽｯﾂﾁｮｳ"]
["013935","北海道","黒松内町","ﾎｯｶｲﾄﾞｳ","ｸﾛﾏﾂﾅｲﾁｮｳ"]
["013943","北海道","蘭越町","ﾎｯｶｲﾄﾞｳ","ﾗﾝｺｼﾁｮｳ"]
["013951","北海道","ニセコ町","ﾎｯｶｲﾄﾞｳ","ﾆｾｺﾁｮｳ"]
["013960","北海道","真狩村","ﾎｯｶｲﾄﾞｳ","ﾏｯｶﾘﾑﾗ"]
["013978","北海道","留寿都村","ﾎｯｶｲﾄﾞｳ","ﾙｽﾂﾑﾗ"]
["013986","北海道","喜茂別町","ﾎｯｶｲﾄﾞｳ","ｷﾓﾍﾞﾂﾁｮｳ"]
["013994","北海道","京極町","ﾎｯｶｲﾄﾞｳ","ｷｮｳｺﾞｸﾁｮｳ"]
["014001","北海道","倶知安町","ﾎｯｶｲﾄﾞｳ","ｸｯﾁｬﾝﾁｮｳ"]
["014010","北海道","共和町","ﾎｯｶｲﾄﾞｳ","ｷｮｳﾜﾁｮｳ"]
["014028","北海道","岩内町","ﾎｯｶｲﾄﾞｳ","ｲﾜﾅｲﾁｮｳ"]
["014036","北海道","泊村","ﾎｯｶｲﾄﾞｳ","ﾄﾏﾘﾑﾗ"]
["014044","北海道","神恵内村","ﾎｯｶｲﾄﾞｳ","ｶﾓｴﾅｲﾑﾗ"]
["014052","北海道","積丹町","ﾎｯｶｲﾄﾞｳ","ｼｬｺﾀﾝﾁｮｳ"]
["014061","北海道","古平町","ﾎｯｶｲﾄﾞｳ","ﾌﾙﾋﾞﾗﾁｮｳ"]
["014079","北海道","仁木町","ﾎｯｶｲﾄﾞｳ","ﾆｷﾁｮｳ"]
["014087","北海道","余市町","ﾎｯｶｲﾄﾞｳ","ﾖｲﾁﾁｮｳ"]
["014095","北海道","赤井川村","ﾎｯｶｲﾄﾞｳ","ｱｶｲｶﾞﾜﾑﾗ"]
["014231","北海道","南幌町","ﾎｯｶｲﾄﾞｳ","ﾅﾝﾎﾟﾛﾁｮｳ"]
["014249","北海道","奈井江町","ﾎｯｶｲﾄﾞｳ","ﾅｲｴﾁｮｳ"]
["014257","北海道","上砂川町","ﾎｯｶｲﾄﾞｳ","ｶﾐｽﾅｶﾞﾜﾁｮｳ"]
["014273","北海道","由仁町","ﾎｯｶｲﾄﾞｳ","ﾕﾆﾁｮｳ"]
["014281","北海道","長沼町","ﾎｯｶｲﾄﾞｳ","ﾅｶﾞﾇﾏﾁｮｳ"]
["014290","北海道","栗山町","ﾎｯｶｲﾄﾞｳ","ｸﾘﾔﾏﾁｮｳ"]
["014303","北海道","月形町","ﾎｯｶｲﾄﾞｳ","ﾂｷｶﾞﾀﾁｮｳ"]
["014311","北海道","浦臼町","ﾎｯｶｲﾄﾞｳ","ｳﾗｳｽﾁｮｳ"]
["014320","北海道","新十津川町","ﾎｯｶｲﾄﾞｳ","ｼﾝﾄﾂｶﾜﾁｮｳ"]
["014338","北海道","妹背牛町","ﾎｯｶｲﾄﾞｳ","ﾓｾｳｼﾁｮｳ"]
["014346","北海道","秩父別町","ﾎｯｶｲﾄﾞｳ","ﾁｯﾌﾟﾍﾞﾂﾁｮｳ"]
["014362","北海道","雨竜町","ﾎｯｶｲﾄﾞｳ","ｳﾘｭｳﾁｮｳ"]
["014371","北海道","北竜町","ﾎｯｶｲﾄﾞｳ","ﾎｸﾘｭｳﾁｮｳ"]
["014389","北海道","沼田町","ﾎｯｶｲﾄﾞｳ","ﾇﾏﾀﾁｮｳ"]
["014524","北海道","鷹栖町","ﾎｯｶｲﾄﾞｳ","ﾀｶｽﾁｮｳ"]
["014532","北海道","東神楽町","ﾎｯｶｲﾄﾞｳ","ﾋｶﾞｼｶｸﾞﾗﾁｮｳ"]
["014541","北海道","当麻町","ﾎｯｶｲﾄﾞｳ","ﾄｳﾏﾁｮｳ"]
["014559","北海道","比布町","ﾎｯｶｲﾄﾞｳ","ﾋﾟｯﾌﾟﾁｮｳ"]
["014567","北海道","愛別町","ﾎｯｶｲﾄﾞｳ","ｱｲﾍﾞﾂﾁｮｳ"]
["014575","北海道","上川町","ﾎｯｶｲﾄﾞｳ","ｶﾐｶﾜﾁｮｳ"]
["014583","北海道","東川町","ﾎｯｶｲﾄﾞｳ","ﾋｶﾞｼｶﾜﾁｮｳ"]
["014591","北海道","美瑛町","ﾎｯｶｲﾄﾞｳ","ﾋﾞｴｲﾁｮｳ"]
["014605","北海道","上富良野町","ﾎｯｶｲﾄﾞｳ","ｶﾐﾌﾗﾉﾁｮｳ"]
["014613","北海道","中富良野町","ﾎｯｶｲﾄﾞｳ","ﾅｶﾌﾗﾉﾁｮｳ"]
["014621","北海道","南富良野町","ﾎｯｶｲﾄﾞｳ","ﾐﾅﾐﾌﾗﾉﾁｮｳ"]
["014630","北海道","占冠村","ﾎｯｶｲﾄﾞｳ","ｼﾑｶｯﾌﾟﾑﾗ"]
["014648","北海道","和寒町","ﾎｯｶｲﾄﾞｳ","ﾜｯｻﾑﾁｮｳ"]
["014656","北海道","剣淵町","ﾎｯｶｲﾄﾞｳ","ｹﾝﾌﾞﾁﾁｮｳ"]
["014681","北海道","下川町","ﾎｯｶｲﾄﾞｳ","ｼﾓｶﾜﾁｮｳ"]
["014699","北海道","美深町","ﾎｯｶｲﾄﾞｳ","ﾋﾞﾌｶﾁｮｳ"]
["014702","北海道","音威子府村","ﾎｯｶｲﾄﾞｳ","ｵﾄｲﾈｯﾌﾟﾑﾗ"]
["014711","北海道","中川町","ﾎｯｶｲﾄﾞｳ","ﾅｶｶﾞﾜﾁｮｳ"]
["014729","北海道","幌加内町","ﾎｯｶｲﾄﾞｳ","ﾎﾛｶﾅｲﾁｮｳ"]
["014818","北海道","増毛町","ﾎｯｶｲﾄﾞｳ","ﾏｼｹﾁｮｳ"]
["014826","北海道","小平町","ﾎｯｶｲﾄﾞｳ","ｵﾋﾞﾗﾁｮｳ"]
["014834","北海道","苫前町","ﾎｯｶｲﾄﾞｳ","ﾄﾏﾏｴﾁｮｳ"]
["014842","北海道","羽幌町","ﾎｯｶｲﾄﾞｳ","ﾊﾎﾞﾛﾁｮｳ"]
["014851","北海道","初山別村","ﾎｯｶｲﾄﾞｳ","ｼｮｻﾝﾍﾞﾂﾑﾗ"]
["014869","北海道","遠別町","ﾎｯｶｲﾄﾞｳ","ｴﾝﾍﾞﾂﾁｮｳ"]
["014877","北海道","天塩町","ﾎｯｶｲﾄﾞｳ","ﾃｼｵﾁｮｳ"]
["015113","北海道","猿払村","ﾎｯｶｲﾄﾞｳ","ｻﾙﾌﾂﾑﾗ"]
["015121","北海道","浜頓別町","ﾎｯｶｲﾄﾞｳ","ﾊﾏﾄﾝﾍﾞﾂﾁｮｳ"]
["015130","北海道","中頓別町","ﾎｯｶｲﾄﾞｳ","ﾅｶﾄﾝﾍﾞﾂﾁｮｳ"]
["015148","北海道","枝幸町","ﾎｯｶｲﾄﾞｳ","ｴｻｼﾁｮｳ"]
["015164","北海道","豊富町","ﾎｯｶｲﾄﾞｳ","ﾄﾖﾄﾐﾁｮｳ"]
["015172","北海道","礼文町","ﾎｯｶｲﾄﾞｳ","ﾚﾌﾞﾝﾁｮｳ"]
{"$rows_left_out":1669}